{"text_format":"1","workbook":"xlsx","n_sheets":19,"sheets":["Input","Output","Results","Domestic - Monthly","Domestic - Annual","Domestic (Tertiary) - Monthly","Domestic (Tertiary) - Annual","Commercial - Monthly","Commercial - Annual","Fire (Office) - Monthly","Fire (Office) - Annual","Municipalities - Monthly","Municipalities - Annual","Loss Limit Discount","Contract Works Discount","Fire Extensions","Escalation","Voluntary Deductible","Metadata"],"not_rendered":{"charts":0,"images":23,"macros":1,"external_links":0,"defined_names":11,"comments":1,"pivot_tables":0},"unopened":[],"bounds":{"document_bytes":16777216,"sheet_cells":100000,"rows_first":2000,"rows_last":500,"rows_between":2000,"halvings":0,"cell_chars":16384,"cell_head_chars":4096},"cells_cut":0,"cells_raw":0,"read":"row_number_cap","date_system":"1900"}

{"sheet":"Input","index":0,"n_rows":16,"n_cols":9,"rows_kept":16,"cut":false,"hidden":false,"merged":[[0,0,3,14],[15,1,15,7],[15,8,15,11]]}
[]
[]
[]
[]
[]
[]
{"$rows_left_out":11}
{"sheet":"Output","index":1,"n_rows":26,"n_cols":6,"rows_kept":26,"cut":false,"hidden":false,"merged":[]}
[]
[null,null,"Aggregate",{"$f":"IF(C2 = \"\", 12, VLOOKUP(C2, Metadata!$S$1:$T$11, 2, FALSE))","v":12}]
[]
[]
[]
[]
{"$rows_left_out":21}
{"sheet":"Results","index":2,"n_rows":35,"n_cols":13,"rows_kept":35,"cut":false,"hidden":true,"merged":[]}
[]
[]
[null,"Gross Written Premium"]
[null,"Class","Domestic - Monthly","Domestic (Tertiary) - Monthly","Domestic - Annual","Domestic (Tertiary) - Annual","Commercial - Monthly","Commercial - Annual","Fire (Office) - Monthly","Fire (Office) - Annual","Municipalities - Monthly","Municipalities - Annual","Aggregate"]
[null,"Fire",{"$f":"SUMIF('Domestic - Monthly'!$D:$D, Results!$B5, 'Domestic - Monthly'!$S:$S)","v":0},{"$f":"SUMIF('Domestic (Tertiary) - Monthly'!$D:$D, Results!$B5, 'Domestic (Tertiary) - Monthly'!$S:$S)","v":0},{"$f":"SUMIF('Domestic - Annual'!$D:$D, Results!$B5, 'Domestic - Annual'!$S:$S)","v":0},{"$f":"SUMIF('Domestic (Tertiary) - Annual'!$D:$D, Results!$B5, 'Domestic (Tertiary) - Annual'!$S:$S)","v":0},{"$f":"SUMIF('Commercial - Monthly'!$D:$D, Results!$B5, 'Commercial - Monthly'!$S:$S)","v":0},{"$f":"SUMIF('Commercial - Annual'!$D:$D, Results!$B5, 'Commercial - Annual'!$S:$S)","v":0},{"$f":"SUMIF('Fire (Office) - Monthly'!$D:$D, Results!$B5, 'Fire (Office) - Monthly'!$S:$S)","v":0},{"$f":"SUMIF('Fire (Office) - Annual'!$D:$D, Results!$B5, 'Fire (Office) - Annual'!$S:$S)","v":0},{"$f":"SUMIF('Municipalities - Monthly'!$D:$D, Results!$B5, 'Municipalities - Monthly'!$S:$S)","v":0},{"$f":"SUMIF('Municipalities - Annual'!$D:$D, Results!$B5, 'Municipalities - Annual'!$S:$S)","v":0},{"$f":"SUM(C5:L5)","v":0}]
[null,"Extensions",null,null,null,null,null,null,null,null,null,null,{"$f":"SUM(C6:L6)","v":0}]
{"$rows_left_out":30}
{"sheet":"Domestic - Monthly","index":3,"n_rows":100,"n_cols":22,"rows_kept":100,"cut":false,"hidden":false,"merged":[[0,21,0,22]],"read":"row_number_cap"}
["Domestic - Monthly",null,null,null,null,null,null,null,null,null,null,null,null,null,null,null,null,null,null,null,null,"Cells with green borders have a drop-down selection!\n"]
["Category","Code","Description","Total Code","Sum Insured/No. of insured items","Rate","Is Percent","Add To Sum Insured Discount","Receive Sum Insured Discount","Add To CW Discount","Receive CW Discount","Contract Period Discount","Minimum Premium","Has Fire Extension Discount","Amount within free extension threshold","Special Dispensation Rate","N/A To Special Dispensation","Unique Code","Premium","System ID"]
[null,"Fire"]
["Domestic Fire","F1","Domestic Fire","Fire",null,3.63E-6,true,true,true,false,false,null,3,false,null,0,true,"DM001",{"$f":"IF(E4 = 0, 0, MAX((E4  * F4) * (IF(I4 = TRUE, 1 - 'Loss Limit Discount'!$D$93, 1)) + ('Fire Extensions'!$D$12 * F4) * (1 - 'Loss Limit Discount'!$D$93), M4))","v":0},148]
["Domestic Fire","F1-MC","Mayors and Councilors","Fire",null,5.45,false,false,false,false,false,null,0,false,null,0,true,null,{"$f":"IF(E5 = 0, 0, MAX((F5 * E5) * (IF(I5 = TRUE, 1 - 'Loss Limit Discount'!$D$93, 1)), M5 * E5))","v":0},2876]
["Extension","Sasria Extensions"]
{"$rows_left_out":95}
{"sheet":"Domestic - Annual","index":4,"n_rows":100,"n_cols":22,"rows_kept":100,"cut":false,"hidden":false,"merged":[[0,21,0,22]]}
["Domestic - Annual",null,null,null,null,null,null,null,null,null,null,null,null,null,null,null,null,null,null,null,null,"Cells with green borders have a drop-down selection!\n"]
["Category","Code","Description","Total Code","Sum Insured/No. of insured items","Rate","Is Percent","Add To Sum Insured Discount","Receive Sum Insured Discount","Add To CW Discount","Receive CW Discount","Contract Period Discount","Minimum Premium","Has Fire Extension Discount","Amount within free extension threshold","Special Dispensation Rate","N/A To Special Dispensation","Unique Code","Premium","System ID"]
[null,"Fire"]
["Domestic Fire","F1","Domestic Fire","Fire",null,3.6300000000000001E-5,true,true,true,false,false,null,30,false,null,0,true,"DA001",{"$f":"IF(E4 = 0, 0, MAX((E4  * F4) * (IF(I4 = TRUE, 1 - 'Loss Limit Discount'!$D$93, 1)) + ('Fire Extensions'!$D$25 * F4)* (1 - 'Loss Limit Discount'!$D$93), M4))","v":0},400]
["Domestic Fire","F1-MC","Mayors and Councilors","Fire",null,54.47,false,false,false,false,false,null,0,false,null,0,true,null,{"$f":"IF(E5 = 0, 0, MAX((F5 * E5) * (IF(I5 = TRUE, 1 - 'Loss Limit Discount'!$L$11, 1)) * (IF(K5 = TRUE, 1 - 'Contract Works Discount'!$D$11, 1)), M5 * E5))","v":0},2877]
["Extension","Sasria Extensions"]
{"$rows_left_out":95}
{"sheet":"Domestic (Tertiary) - Monthly","index":5,"n_rows":99,"n_cols":22,"rows_kept":99,"cut":false,"hidden":false,"merged":[[0,21,0,22]]}
["Domestic - Monthly",null,null,null,null,null,null,null,null,null,null,null,null,null,null,null,null,null,null,null,null,"Cells with green borders have a drop-down selection!\n"]
["Category","Code","Description","Total Code","Sum Insured/No. of insured items","Rate","Is Percent","Add To Sum Insured Discount","Receive Sum Insured Discount","Add To CW Discount","Receive CW Discount","Contract Period Discount","Minimum Premium","Has Fire Extension Discount","Amount within free extension threshold","Special Dispensation Rate","N/A To Special Dispensation","Unique Code","Premium","System ID"]
[null,"Fire"]
["Domestic Fire","F1-T","Tertiary Institutions","Fire",null,4.3599999999999998E-6,true,true,true,false,false,null,3,false,null,0.25,true,null,{"$f":"IF(E4 = 0, 0, MAX((E4  * F4) * (IF(I4 = TRUE, 1 - 'Loss Limit Discount'!$D$93, 1)) + ('Fire Extensions'!$D$38 * F4) * (1 - 'Loss Limit Discount'!$D$93), M4))","v":0},2871]
["Extension","Sasria Extensions"]
["Extension","EX","Rent","Fire",null,{"$f":"$F$4","v":4.3599999999999998E-6},true,true,true,false,false,null,0,true,{"$f":"IF(E6 < 'Fire Extensions'!$D$6, 'Domestic (Tertiary) - Monthly'!E6, 'Fire Extensions'!$D$6)","v":0},0,true,"DM002",null,154]
{"$rows_left_out":94}
{"sheet":"Domestic (Tertiary) - Annual","index":6,"n_rows":99,"n_cols":22,"rows_kept":99,"cut":false,"hidden":false,"merged":[[0,21,0,22]]}
["Domestic - Annual",null,null,null,null,null,null,null,null,null,null,null,null,null,null,null,null,null,null,null,null,"Cells with green borders have a drop-down selection!\n"]
["Category","Code","Description","Total Code","Sum Insured/No. of insured items","Rate","Is Percent","Add To Sum Insured Discount","Receive Sum Insured Discount","Add To CW Discount","Receive CW Discount","Contract Period Discount","Minimum Premium","Has Fire Extension Discount","Amount within free extension threshold","Special Dispensation Rate","N/A To Special Dispensation","Unique Code","Premium","System ID"]
["Header","Fire"]
["Domestic Fire","F1-T","Tertiary Institutions","Fire",null,4.3600000000000003E-5,true,true,true,false,false,null,30,false,null,0,true,null,{"$f":"IF(E4 = 0, 0, MAX((E4  * F4) * (IF(I4 = TRUE, 1 - 'Loss Limit Discount'!$D$93, 1)) + ('Fire Extensions'!$I$38 * F4) * (1 - 'Loss Limit Discount'!$D$93), M4))","v":0},1872]
["Extension","Sasria Extensions"]
["Extension","EX","Rent","Fire",null,{"$f":"$F$4","v":4.3600000000000003E-5},true,true,true,false,false,null,0,true,{"$f":"IF(E6 < 'Fire Extensions'!$D$19, 'Domestic (Tertiary) - Annual'!E6, 'Fire Extensions'!$D$19)","v":0},0,true,"DA002",null,406]
{"$rows_left_out":94}
{"sheet":"Commercial - Monthly","index":7,"n_rows":121,"n_cols":22,"rows_kept":121,"cut":false,"hidden":false,"merged":[[0,21,0,22]]}
["Commercial - Monthly",null,null,null,null,null,null,null,null,null,null,null,null,null,null,null,null,null,null,null,null,"Cells with green borders have a drop-down selection!\n"]
["Category","Code","Description","Total Code","Sum Insured/No. of insured items","Rate","Is Percent","Add To Sum Insured Discount","Receive Sum Insured Discount","Add To CW Discount","Receive CW Discount","Contract Period Discount","Minimum Premium","Has Fire Extension Discount","Amount within free extension threshold","Special Dispensation Rate","N/A To Special Dispensation",null,"Premium","System ID"]
[null,"Fire"]
["Commercial Fire","F2","Commercial Fire","Fire",null,2.906E-5,true,true,true,false,false,null,50,false,null,3.63E-6,false,null,{"$f":"IF(E4 = 0, 0, MAX((E4  * F4) * (IF(I4 = TRUE, 1 - 'Loss Limit Discount'!$D$93, 1)) + ('Fire Extensions'!$I$12 * 'Commercial - Monthly'!$F$4) * (1 - 'Loss Limit Discount'!$D$93), M4))","v":0},261]
["Commercial Fire","F4","Fire - SME","Fire",null,{"$f":"_xlfn.IFNA(VLOOKUP(E5, Metadata!$L$43:$M$46, 2, FALSE), 0)","v":0},true,false,false,false,false,null,0,null,null,null,null,null,{"$f":"F5","v":0}]
["Extension","Sasria Extensions"]
{"$rows_left_out":116}
{"sheet":"Commercial - Annual","index":8,"n_rows":122,"n_cols":22,"rows_kept":122,"cut":false,"hidden":false,"merged":[[0,21,0,22]]}
["Commercial - Annual",null,null,null,null,null,null,null,null,null,null,null,null,null,null,null,null,null,null,null,null,"Cells with green borders have a drop-down selection!\n"]
["Category","Code","Description","Total Code","Sum Insured/No. of insured items","Rate","Is Percent","Add To Sum Insured Discount","Receive Sum Insured Discount","Add To CW Discount","Receive CW Discount","Contract Period Discount","Minimum Premium","Has Fire Extension Discount","Amount within free extension threshold","Special Dispensation Rate","N/A To Special Dispensation","Unique Code","Premium","System ID"]
[null,"Fire"]
["Commercial Fire","F2","Commercial Fire","Fire",null,2.9058000000000003E-4,true,true,true,false,false,null,500,false,null,3.6300000000000001E-5,false,"CA001",{"$f":"IF(E4 = 0, 0, MAX((E4  * F4) * (IF(I4 = TRUE, 1 - 'Loss Limit Discount'!$D$93, 1)) + ('Fire Extensions'!$I$25 * F4) * (1 - 'Loss Limit Discount'!$D$93), M4))","v":0},2]
["Commercial Fire","F4","Fire - SME","Fire",null,{"$f":"_xlfn.IFNA(VLOOKUP(E5, Metadata!$P$43:$Q$46, 2, FALSE), 0)","v":0},false,false,false,false,false,null,0,null,null,null,null,null,{"$f":"F5","v":0}]
["Extensions","Sasria Extensions"]
{"$rows_left_out":117}
{"sheet":"Fire (Office) - Monthly","index":9,"n_rows":83,"n_cols":22,"rows_kept":83,"cut":false,"hidden":false,"merged":[[0,21,0,22]]}
["Commercial - Monthly",null,null,null,null,null,null,null,null,null,null,null,null,null,null,null,null,null,null,null,null,"Cells with green borders have a drop-down selection!\n"]
["Category","Code","Description","Total Code","Sum Insured/No. of insured items","Rate","Is Percent","Add To Sum Insured Discount","Receive Sum Insured Discount","Add To CW Discount","Receive CW Discount","Contract Period Discount","Minimum Premium","Has Fire Extension Discount","Amount within free extension threshold","Special Dispensation Rate","N/A To Special Dispensation",null,"Premium","System ID"]
[null,"Fire"]
["Commercial Fire","F2(O)","Commercial Fire (Office)","Fire",null,2.088E-5,true,true,true,false,false,null,50,null,null,null,null,null,{"$f":"IF(E4 = 0, 0, MAX((E4  * F4) * (IF(I4 = TRUE, 1 - 'Loss Limit Discount'!$D$93, 1)) + ('Fire Extensions'!$D$51 * F4) * (1 - 'Loss Limit Discount'!$D$93), M4))","v":0}]
["Extension","Sasria Extensions"]
["Extension","EX","Rent","Fire",null,{"$f":"$F$4","v":2.088E-5},true,true,true,false,false,null,0,true,{"$f":"IF(E6 < 'Fire Extensions'!$I$6, 'Fire (Office) - Monthly'!E6, 'Fire Extensions'!$I$6)","v":0},3.63E-6,true,{"$f":"E6-O6","v":0},null,267]
{"$rows_left_out":78}
{"sheet":"Fire (Office) - Annual","index":10,"n_rows":82,"n_cols":22,"rows_kept":82,"cut":false,"hidden":false,"merged":[[0,21,0,22]]}
["Commercial - Annual",null,null,null,null,null,null,null,null,null,null,null,null,null,null,null,null,null,null,null,null,"Cells with green borders have a drop-down selection!\n"]
["Category","Code","Description","Total Code","Sum Insured/No. of insured items","Rate","Is Percent","Add To Sum Insured Discount","Receive Sum Insured Discount","Add To CW Discount","Receive CW Discount","Contract Period Discount","Minimum Premium","Has Fire Extension Discount","Amount within free extension threshold","Special Dispensation Rate","N/A To Special Dispensation","Unique Code","Premium","System ID"]
[null,"Fire"]
["Commercial Fire","F2(O)","Commercial Fire (Office)","Fire",null,2.0880000000000001E-4,true,true,true,false,false,null,500,null,null,null,null,null,{"$f":"IF(E4 = 0, 0, MAX((E4  * F4) * (IF(I4 = TRUE, 1 - 'Loss Limit Discount'!$D$93, 1)) + ('Fire Extensions'!$I$51 * F4) * (1 - 'Loss Limit Discount'!$D$93), M4))","v":0}]
["Extensions","Sasria Extensions"]
["Extensions","EX","Rent","Fire",null,{"$f":"$F$4","v":2.0880000000000001E-4},true,true,true,false,false,null,0,true,{"$f":"IF(E6 < 'Fire Extensions'!$I$19, 'Fire (Office) - Annual'!E6, 'Fire Extensions'!$I$19)","v":0},3.6300000000000001E-5,true,"CA002",null,76]
{"$rows_left_out":77}
{"sheet":"Municipalities - Monthly","index":11,"n_rows":83,"n_cols":22,"rows_kept":83,"cut":false,"hidden":false,"merged":[[0,21,0,22]]}
["Commercial - Monthly",null,null,null,null,null,null,null,null,null,null,null,null,null,null,null,null,null,null,null,null,"Cells with green borders have a drop-down selection!\n"]
["Category","Code","Description","Total Code","Sum Insured/No. of insured items","Rate","Is Percent","Add To Sum Insured Discount","Receive Sum Insured Discount","Add To CW Discount","Receive CW Discount","Contract Period Discount","Minimum Premium","Has Fire Extension Discount","Amount within free extension threshold","Special Dispensation Rate","N/A To Special Dispensation",null,"Premium","System ID"]
[null,"Fire"]
["Commercial Fire","Mun","Municipalities","Fire",null,2.9580000000000001E-5,false,true,true,false,false,null,50,null,null,null,null,null,{"$f":"IF(E4 = 0, 0, MAX((E4  * F4) * (IF(I4 = TRUE, 1 - 'Loss Limit Discount'!$D$93, 1)) + ('Fire Extensions'!$D$64 * 'Commercial - Monthly'!$F$4) * (1 - 'Loss Limit Discount'!$D$93), M4))","v":0}]
["Extension","Sasria Extensions"]
["Extension","EX","Rent","Fire",null,{"$f":"$F$4","v":2.9580000000000001E-5},true,true,true,false,false,null,0,true,{"$f":"IF(E6 < 'Fire Extensions'!$I$6, 'Municipalities - Monthly'!E6, 'Fire Extensions'!$I$6)","v":0},3.63E-6,true,{"$f":"E6-O6","v":0},null,267]
{"$rows_left_out":78}
{"sheet":"Municipalities - Annual","index":12,"n_rows":82,"n_cols":22,"rows_kept":82,"cut":false,"hidden":false,"merged":[[0,21,0,22]]}
["Commercial - Annual",null,null,null,null,null,null,null,null,null,null,null,null,null,null,null,null,null,null,null,null,"Cells with green borders have a drop-down selection!\n"]
["Category","Code","Description","Total Code","Sum Insured/No. of insured items","Rate","Is Percent","Add To Sum Insured Discount","Receive Sum Insured Discount","Add To CW Discount","Receive CW Discount","Contract Period Discount","Minimum Premium","Has Fire Extension Discount","Amount within free extension threshold","Special Dispensation Rate","N/A To Special Dispensation","Unique Code","Premium","System ID"]
[null,"Fire"]
["Commercial Fire","Mun","Municipalities","Fire",null,2.9579999999999998E-4,false,true,true,false,false,null,500,null,null,null,null,null,{"$f":"IF(E4 = 0, 0, MAX((E4  * F4) * (IF(I4 = TRUE, 1 - 'Loss Limit Discount'!$D$93, 1)) + ('Fire Extensions'!$I$64 * F4) * (1 - 'Loss Limit Discount'!$D$93), M4))","v":0}]
["Extensions","Sasria Extensions"]
["Extensions","EX","Rent","Fire",null,{"$f":"$F$4","v":2.9579999999999998E-4},true,true,true,false,false,null,0,true,{"$f":"IF(E6 < 'Fire Extensions'!$I$19, 'Municipalities - Annual'!E6, 'Fire Extensions'!$I$19)","v":0},3.6300000000000001E-5,true,"CA002",null,76]
{"$rows_left_out":77}
{"sheet":"Loss Limit Discount","index":13,"n_rows":164,"n_cols":15,"rows_kept":164,"cut":false,"hidden":true,"merged":[]}
[]
[]
[null,null,"Domestic",null,null,null,null,null,null,null,"Domestic"]
[null,null,"Annual",null,null,null,null,null,null,null,"Monthly"]
[]
[null,null,"Total Sum Insured",{"$f":"SUMIF('Domestic - Annual'!$H$4:$H$123, \"TRUE\", 'Domestic - Annual'!$E$4:$E$123)","v":0},null,null,null,null,null,null,"Total Sum Insured",{"$f":"SUMIF('Domestic - Monthly'!$H$4:$H$123, \"TRUE\", 'Domestic - Monthly'!$E$4:$E$123)","v":0}]
{"$rows_left_out":159}
{"sheet":"Contract Works Discount","index":14,"n_rows":142,"n_cols":15,"rows_kept":142,"cut":false,"hidden":true,"merged":[]}
[]
[]
[null,null,"Domestic",null,null,null,null,null,null,null,"Commercial"]
[null,null,"Annual",null,null,null,null,null,null,null,"Annual"]
[]
[null,null,"Total Sum Insured",{"$f":"SUMIF('Domestic - Annual'!$J$4:$J$123, \"TRUE\", 'Domestic - Annual'!$E$4:$E$123)","v":0},{"$f":"IF(D6 > C25, \"Please consult Sasria!\", \"Contract amount within bounds\")","v":"Contract amount within bounds"},null,null,null,null,null,"Total Sum Insured",{"$f":"SUMIF('Commercial - Annual'!$J$4:$J$123, \"TRUE\", 'Commercial - Annual'!$E$4:$E$123)","v":0},{"$f":"IF(L6 > K25, \"Please consult Sasria!\", \"Contract amount within bounds\")","v":"Contract amount within bounds"}]
{"$rows_left_out":137}
{"sheet":"Fire Extensions","index":15,"n_rows":64,"n_cols":9,"rows_kept":64,"cut":false,"hidden":true,"merged":[]}
[]
[]
[null,null,"Domestic",null,null,null,null,"Commercial"]
[null,null,"Monthly",null,null,null,null,"Monthly"]
[]
[null,null,"Extension threshold",100000,null,null,null,"Extension threshold",250000]
{"$rows_left_out":59}
{"sheet":"Escalation","index":16,"n_rows":260,"n_cols":14,"rows_kept":260,"cut":false,"hidden":true,"merged":[]}
[]
[]
[null,null,"Domestic",null,null,null,null,"Domestic",null,null,null,null,"First",1]
[null,null,"Monthly",null,null,null,null,"Annual",null,null,null,null,"Second",0.5]
[null,null,null,null,null,null,null,null,null,null,null,null,"Third",0.25]
["First",0.2,"First Year (10-20%)",{"$f":"B6 * 'Domestic - Monthly'!$F$4 * VLOOKUP(A6, $M$3:$N$7, 2, FALSE)","v":7.2600000000000002E-7},null,"First",0.2,"First Year (10-20%)",{"$f":"G6 * 'Domestic - Annual'!$F$4 * VLOOKUP(F6, $M$3:$N$7, 2, FALSE)","v":7.2600000000000008E-6},null,null,null,"Fourth",0.2]
{"$rows_left_out":255}
{"sheet":"Voluntary Deductible","index":17,"n_rows":13,"n_cols":3,"rows_kept":13,"cut":false,"hidden":true,"merged":[]}
[]
[null,"Deductible To Apply","Discount"]
[null,0,0]
[null,1000000,0.05]
[null,{"$f":"B4 + 1000000","v":2000000},9.5000000000000001E-2]
[null,{"$f":"B5 + 1000000","v":3000000},0.13500000000000001]
{"$rows_left_out":8}
{"sheet":"Metadata","index":18,"n_rows":55,"n_cols":29,"rows_kept":55,"cut":false,"hidden":true,"merged":[]}
[true,null,"Domestic Monthly",null,null,null,"Domestic Annual",null,null,null,"Commercial Monthly",null,null,null,"Commercial Annual",null,null,null,"Domestic - Monthly",2,null,null,"GIT Monthly",null,null,null,"GIT Annual"]
[false,null,"SC1","12 Months",3.63E-6,null,"SC1","12 Months",3.6300000000000001E-5,null,"ASC","12 Months",6.3999999999999997E-5,null,"ASC","12 Months",6.4000000000000005E-4,null,"Domestic - Annual",4]
[null,null,"SC1","15 Months",3.1300000000000001E-6,null,"SC1","15 Months",3.1300000000000002E-5,null,"ASC","15 Months",6.0999999999999999E-5,null,"ASC","15 Months",6.0999999999999997E-4,null,"Tertiary Institutions - Monthly",3,null,null,"Marine","With RSCC","Without RSCC",null,"Marine","With RSCC","Without RSCC"]
["With RSCC",null,"SC1","18 Months",2.9299999999999999E-6,null,"SC1","18 Months",2.9300000000000001E-5,null,"ASC","18 Months",5.8100000000000003E-5,null,"ASC","18 Months",5.8100000000000003E-4,null,"Tertiary Institutions - Annual",5,null,null,"Marine Cargo & Goods in Transit",{"$f":"Y4 * 0.5","v":1.0440000000000001E-6},2.0880000000000002E-6,null,"Marine Cargo & Goods in Transit",{"$f":"AC4 * 0.5","v":1.044E-5},2.088E-5]
["Without RSCC",null,"SC1","24 Months",2.2199999999999999E-6,null,"SC1","24 Months",2.2200000000000001E-5,null,"ASC","24 Months",5.52E-5,null,"ASC","24 Months",5.5199999999999997E-4,null,"Commercial - Monthly",6,null,null,"Storage at final w/house or depot",null,2.088E-5,null,"Storage at final w/house or depot",null,2.0880000000000001E-4]
[null,null,"SC1","30 Months",1.61E-6,null,"SC1","30 Months",1.6099999999999998E-5,null,"Specified Standing Charges",null,null,null,"Specified Standing Charges",null,null,null,"Commercial - Annual",7,null,null,"Estimated Gross Annual Turnover",{"$f":"Y6 * 0.5","v":8.71E-7},1.742E-6,null,"Estimated Gross Annual Turnover",8.7099999999999996E-6,1.7419999999999999E-5]
{"$rows_left_out":49}